Skip to content

Makefile Error 2

How to install drivers for RTL8723BE WIFI in Linux OS and How to fix MAKE file error in Kali Linux

RECOMMENDED: If you have Windows errors then we strongly recommend that you download and run this (Windows) Repair Tool.

cc1: some warnings being treated as errors /usr/src/linux-headers-4.12.0-kali1- common/scripts/Makefile.build:307: recipe for target.

Hi all, with slightly different objective ( USB to serial adapter with Belkin chip ) : I was trying to use this guide to add belkin_sa.ko module to Kernel 2.6.32.39.

Error Is 0x8004060c 00000000 00000000 cfa53800 bf013ce0 bf013c5400001 00000000 00000002 0d01a8c0f851 Aug 1 02:00:12 kernel: <0>3c00: 00000000 cf064380 cfa4ec4000 bf573f4c c0423f90 cf0643882017941 cfbc6444 c0283f7c 000000000000 00000000 cfa43000. Office 365 – This message could not be

Workbench User Guide Eclipse platform overview Getting started Basic tutorial The Workbench Editors and views Editors Views

Build Error on line 44 of wifi_nvram_image.h | Avnet CloudConnectKits – make.exe[2]: *** [main_app] Error 2 tools/makefiles/standard_platform_targets.mk :48: recipe for target 'bootloader' failed. Makefile:220: recipe.

error: ld returned 1 exit status Makefile:3502: fallo en las instrucciones para el objetivo ‘libgmap.la’ make[2]: *** [libgmap.la] Error 1 make[2]: se sale del directorio ‘/home/irving/Descargas/gmap-2017-08-15/src’ Makefile:3417: fallo.

This guide takes you from a clean Ubuntu install to a working installation of OpenCV 2.4.1. Read More.

makefile+error+2怎么回事. 历史上最心酸的「背锅侠」,我们不能忘记他

Stop. /usr/src/linux-headers-4.3.0-kali1-common/Makefile:1395: recipe for target ‘_module_/home/drc/drc-mac80211/’ failed make[2]: *** [_module_/home/drc/drc-mac80211/] Error 2 Makefile:146: recipe for target ‘sub-make’ failed.

Very long, extensive tutorial on how to use the crash utility to analyze Linux kernel crash memory cores, including detailed analysis of crash reports, using cscope.

Build/Release/ardrone_testing_tool] Error 1 app.makefile:33: recipe for target 'all' failed make[2]: *** [all] Error 2 Makefile:163: recipe for target.

Makefile: Error1. Ask Question. up vote 6 down vote favorite. 2. I have a very simple c programme: int main() { return(1); } and a simple Makefile: all:.

Error Writing Data Poweriso 544 Mysql Socket Error On Connect function(error){ console.log("There was an error in. var http = require(‘http’).Server(app); var io = require("socket.io")(http);. PHP MySQL socket error FAQ: Help, I’m getting a MySQL error

I am trying to building an app from ubuntu 12.04 terminal from home directory. I am using lighttpd, php and mysql in my ubuntu. But The building aborting when it.

For the latest version of the Yocto Project Reference Manual associated with this Yocto Project release (version 2.4.

Chapter 2: Running NASM 2.1 NASM Command-Line Syntax. To assemble a file, you issue a command of the form. nasm -f <format> <filename> [-o <output>]

^ makefile:2: recipe for target 'mnisten' failed. system_category()' collect2: error: ld returned 1 exit status makefile:2: recipe for target 'mnisten' failed.

Jun 24, 2015. build/target/user-part/platform-6-m-lto/user-part.elf] Error 1 make[2]:. -part1/ makefile] Error 2 C:Sparkphotonfirmware-developmodules>.

error: field ‘muram_res’ has incomplete type struct resource muram_res; /* MURAM resource */ drivers/net/ethernet/freescale/fman/fman.h:330:2: error: unknown type name ‘fman_exceptions_cb’.

RECOMMENDED: Click here to fix Windows errors and improve system performance