Skip to content

Gmake Exit Error

RECOMMENDED: If you have Windows errors then we strongly recommend that you download and run this (Windows) Repair Tool.

Error Id 2020 Srv.Croatian Research and Education Federation ACOnet Identity Federation Arnes AAI Federation BASF BELNET Federation CHINA CERNET Federation COBISS AAI Federation COFRE (Comunidad Federada REUNA) – Chile Canadian Access Federation (CAF)

These functions control the. will generate a fatal error while make. This function works similarly to the error function, above, except that make doesn't exit.

-k: If a non-ignored error occurs while executing the commands to bring a target. Stop processing when a nonzero exit status is returned by a command. If both – k. If no target is specified, make uses the first target defined in the first makefile.

How to make makefile exit with error when using a loop?. though. You could instead use exit with a non-zero code: x:. How to execute gmake/make from a bash.

Jan 7, 2012. If for instance you would want to exit status of the 'ls' command in bash you would. since that is the error 'ls' returns when there is an unknown.

Where can I find a list of 'make' error codes?. Exit status is 'Successful' 2:. How can I get gmake to give me a list of all included makefiles? 7

2. Getting Started. This section describes how to build and run LAMMPS, for both new and experienced users.

It also handles certain errors better. For instance, if you’re doing an update/insert/delete sequence, and one of the sequences fails, PostgreSQL can roll back the entire operation and provide an error, leaving your database in an.

C -o debug-charm.o returned error code 1 charmc exiting../bin/charmc – optimize -c -I. ckgraphTemp.C gmake: *** [debug-charm.o] Error 1 gmake: *** Waiting.

If the variable is not set then make should display a message and then exit. state of two shell variables. Error: Variables not set correctly"; exit.

I use gcc 4.8.1 from on Mac OSX Mountain Lion. I am trying to compile a C++ program which uses the to_string function in <string>. I need.

Apr 20, 2017. Arduino Simulink external mode error. collect2.exe: error: ld returned 1 exit status gmake: *** [./arduino_communication.elf] Error 1. The part.

How To Compile Qt with Visual Studio – Pavel Holoborodko – Yes, you are right, this is 32 bits build. And yes, you are correct again – in order to compile x64 binaries just use Visual Studio x64 Win64 Command Prompt (2010).

To ignore exit codes for part of a makefile, use a dash (–) command modifier or. /K, Continues building unrelated dependencies, if a command returns an error.

Interpretation Of Standard Error Of Estimate In Regression Main Effect of Gender Given Rank, Dept, Gender X Rank, Gender X Dept, Years, Merit 6 Chart 7 displays estimates of $$theta_t$$, the time-varying marginal effect of. The second easy

1 Overview of make. The make utility automatically determines which pieces of a large program need to be recompiled, and issues commands to recompile them.

In the absence of the NOCOPY hint the entire orders collection would have been copied into the theorders variable upon exit from the procedure.

gmake[1]: *** [sysbios.aem4f] Error 1. gmake[1]: Target. line 209: xdc.cfg. SourceDir : Build of generated source libraries failed: exit status = 2:.

The latest version of this topic can be found at Exit Codes from NMAKE. NMAKE returns the following exit codes: Code. – An error or exit code from a command

Here is a list of the more common errors you might see generated by make, and some information about what they mean and how to fix them. Error messages are all either.

Cure: Install and use Gnu make. pm_exit_value in /usr/lpp/ppe.poe/lib/libmpi.a is not defined. 0509-023 Symbol pm_exit_value in /usr/lpp/ppe.poe/lib/libmpi.a is not defined. 0509-022 Cannot load library libvtd.a[dynamic.o]. 0509-026.

RECOMMENDED: Click here to fix Windows errors and improve system performance