Skip to content

Error Old-style Parameter Declarations In Prototyped Function Definition

RECOMMENDED: If you have Windows errors then we strongly recommend that you download and run this (Windows) Repair Tool.

identifier scope in old-style. ("old-style parameter declarations in prototyped function. why does it not work with an old-style function definition.

Gimpel Software’s PC-lint and FlexeLint On-Line Demos. On-Line Message Reference for FlexeLint and PC-lint (aka FlexeLint for Windows)

Functions: Function Prototypes – A computer program is the key to the digital city: If you know. and its return type to the rest of the program prior to the function's actual declaration. Old style compilers do no error checking on parameter lists.

What book do you recommend? We don’t recommend a book. It’s naive to expect that one book could be so encompassing as to satisfy everybody and every topic.

Probability – This shows the global risk of radioactive contamination. The map shows the annual probability in percent of radioactive.

/usr/include/bits/string3.h:90: error: old-style parameter declarations in prototyped function definition make: *** [lib/bcopy.o] Error 1

According to Corvino, Gallagher has fallen into the error of thinking. her maternal function for the child” can be replaced by another mother who can perform her maternal function. Similarly, Corvino argues, the traditional definition of.

Jul 17, 2014. expected declaration specifiers before 'asm' NE10_math.h. old-style parameter declarations in prototyped function definition. make.exe: *** [obj/local/armeabi/ objs/test-jni/Platform.o] Error 1 test C/C++ Problem. expected.

This error means that you are trying to index into an array with a type which is not an. old-style parameter declarations in prototyped function definition

Here's a simple function delcared and defined using old style. in scope if it encounters the definition of the function error(). old style C function.

Star Wars Empire At War Installation Error Action · The game is set before the Battle of Yavin, while the Empire is still constructing the. There was an error trying to load your rating for this title.

Extensions to the C Language Family – return 0; /* Control comes here from access if it detects an error. */ failure: return -1; } A nested function. declaration must match a "real" declaration in parameter name and data type. Note that the comma after the string constant.

Cae_TWI_Slave.c:196: error: old-style parameter declarations in prototyped function definition./Cae_TWI_Slave.c:171: error: expected '{' at.

It is not an error to undefine a name that is currently not defined. For instance, given the declaration in stdio.h, one cannot pass an int as the first argument. A function prototype with an empty formal parameter list is an old style declaration.

Error suppression with -esym does not require (nor want) the parameters. Because of type qualification, function prototypes, and type compounding, it may. For example a struct is defined in two separate modules rather than in one. This is mixing old-style function declarations with the new-style and is not permitted.

Its function is to read the * next replacement name from the. It assumes the cursor "hCForEach***" * has already been opened by its caller. * worker_type is a parameter that indicates whether we call this for a database (1) or for a table.

Old-style function declarations also generate warnings if you subsequently declare or define the same function with either an ellipsis or a parameter with a type that.

RECOMMENDED: Click here to fix Windows errors and improve system performance