Skip to content

Error Expected Before Token Gcc

Buckys C++ Programming Tutorials - 15 - Placing Classes in Separate Files

RECOMMENDED: If you have Windows errors then we strongly recommend that you download and run this (Windows) Repair Tool.

Extend your 50g with C – Part 1. Introduction. This lengthy article explains why you would and how you can extend the functionality of your 50g using C. Complete.

Installing OpenCV 2.4.1 in Ubuntu 12.04 LTS – Sebastian. – EDIT: I published a new guide using Ubuntu 14.04 LTS and OpenCV 2.4.9 here. The latest Long Term Support version of Ubuntu(12.04 LTS) is out and a new version of.

gcc-4.1.2/gcc/gthr-posix.h:513: error: expected ‘)’ before ‘*’ token././gcc-4.1.2/gcc/gthr-posix.h:522: error: expected ‘)’ before ‘*’ token././gcc-4.1.2/gcc/gthr-posix.h:528: error: expected ‘)’ before ‘key’././gcc-4.1.2/gcc/gthr-posix.h.

I am receiving these errors while attempting to compile my program with GCC and i'm not sure whats causing them. functions.h:21: error: expected ')' before '[' token.

Appendix C: NASM Version History C.1 NASM 2 Series. The NASM 2 series supports x86-64, and is the production version of NASM since 2007. C.1.1 Version 2.13.01

GCC Debugging/g++/Errors. 10 expected 'TOKEN' before 'TOKEN' token; 11 expected primary-expression before. syntax error before 'CHARACTER' token; in GCC.

Vpn Client Error Reason 413 VPN Error 413: User authentication failed. I'm getting an error " Secure VPN Connection terminated locally by the Client. My current VPN client settings are: We are attempting to use

Sep 19, 2014. [[email protected]]# gcc d.c d.c:6: error: expected ')' before '*' token d.c:9: error:. your code, it's clear that you missed typedef keyword before struct

Package: src:rush > Version: 1.8+dfsg-1 >. > In file included from inttostr.h:25:0, > from anytostr.c:31, > from imaxtostr.c:5: > intprops.h:236:34: error: expected ‘)’ before ‘(‘ token > __builtin_add_overflow (a, b, (__typeof__ ((a).

Ftp File Upload Error 550 The remote server returned an error: (550) File unavailable (e.g., file not found. The file to be uploaded is Dim DailyDataHistory = GlobalItems. Many organizations and cloud services still rely

I'm brand new to C, (like started 2 days ago) and I am having compile issues due to syntax but the error messages I am getting from gcc are not helping me much. I.

lib/gcc/mingw32/4.4.1/././././include/stdio.h:491: error: expected declaration specifiers or ‘.’ before ‘(‘ token c:mingw-4.4.1bin./lib/gcc/mingw32/4.4.1/././././include/stdio.h:491: error: expected declaration specifiers or.

62228 – gcc : expected identifier before numeric constant – GCC Bugzilla – Bug. expected identifier before numeric constant Last. error: expected identifier before numeric constant make: *** [t] Error 1 Error is due to.

Aug 6, 2010. cardinfo struct is still undefined on the line with error. Put a forward declaration before it: struct cardinfo; static int cardinit(struct cardinfo *card);.

error: expected ‘=’, ‘,’, ‘;’, ‘asm’ or ‘__attribute__’ before ‘{’ token parser.c:153: error: expected ‘=’, ‘,’, ‘;’, ‘asm’ or ‘__attribute__’ before ‘{’ token parser.c:159: error: expected.

C and Assembly (error: expected identifier or '. I simply converted from C to assembly using the linux command line "gcc -S.". expected ')' before '*' token.

May 24, 2010. Barring misspellings, that error is almost invariably caused by a missing typedef. In other words. GCC compiles that snippet above just fine.

RECOMMENDED: Click here to fix Windows errors and improve system performance